{"text_format":"2","workbook":"xlsx","n_sheets":9,"sheets":["Reisekostenabrechnung - 2015","Reisekostenabrechnung - 2019","Bearbeitungshinweise","data_fill","VMA2016","VMA14","VMA15","Tabelle1","Kürzung"],"not_rendered":{"charts":0,"images":2,"macros":0,"external_links":2,"defined_names":16,"comments":0,"pivot_tables":0},"unopened":[],"bounds":{"document_bytes":16777216,"sheet_cells":100000,"run_cost":"one","rows_first":2000,"rows_last":500,"rows_between":2000,"halvings":0,"cell_chars":16384,"cell_head_chars":4096},"cells_cut":0,"cells_raw":0,"read":"whole","date_system":"1900"}

{"sheet":"Reisekostenabrechnung - 2015","index":0,"n_rows":34,"n_cols":17,"rows_kept":34,"cut":false,"hidden":true,"merged":[[6,12,6,13],[0,0,0,16],[2,0,2,3],[29,0,29,8],[6,0,6,7],[6,14,6,15],[8,1,8,2],[4,0,4,3],[2,10,2,12],[2,13,2,16],[7,4,7,6],[33,3,33,7],[31,12,31,13],[33,12,33,13],[33,0,33,2],[34,0,40,16],[31,0,31,2],[31,3,31,7],[33,9,33,10]]}
["Reisekostenabrechnung 2016 (Inland)"]
[]
["Reisekostenabrechnung",{"$nulls":6},"von",null,null,"Name:"]
[{"$nulls":7},"bis"]
["Ich bin Arbeitnehmer?",{"$nulls":7},"ja"]
[]
["Reisezeiten",{"$nulls":7},"Reiseziel","Reisezweck ",null,"Verpflegung","Fahrtkosten",null,"Übernachtung",null,"Sonstiges"]
["Reisetag","Beginn","Ende","Über-nachtung","Wurden bestimmte Mahlzeiten gestellt bzw. separat abgerechnet?",null,null,"Dauer","Reiseziel ","Reisezweck","Verpfle-gungspau-schale","Pauschale","gefahrene Strecke (gesamt)","Fahrt-kosten (PKW)","Pauschal","Nachweis","lt. Anlage (Bsp.: Parkkosten, Autobahnge-bühren)"]
["Datum","Zeit",null,null,"Frühstück","Mittag ","Abendessen","Std.","Ort","Erläuterungen","EUR",{"$f":"+K9","v":"EUR"},"km","EUR","EUR","EUR","EUR"]
["2016-08-23","07:00:00",1,{"$nulls":4},{"$f":"C10-B10","v":0.70833333333333326},"Berlin",null,{"$f":"IF($I$5=\"ja\",IF(H10<TIME(8,0,0),0,IF(H10<TIME(23,59,59),12,24)),\"\")","v":12},{"$f":"+K10+Kürzung!F5","v":{"$error":"#REF!"}},null,{"$f":"M10*0.3","v":0},{"$f":"IF(AND($I$5=\"ja\",D10=\"ja\"),IF(P10=\"\",20,\"\"),\"\")","v":""}]
["2016-08-24","00:00:00",1,"ja","ja",null,null,1,"Berlin",null,{"$f":"IF($I$5=\"ja\",IF(H11<TIME(8,0,0),0,IF(H11<TIME(23,59,59),12,24)),\"\")","v":24},{"$f":"+K11+Kürzung!F6","v":{"$error":"#REF!"}},null,0,{"$f":"IF(AND($I$5=\"ja\",D11=\"ja\"),IF(P11=\"\",20,\"\"),\"\")","v":20}]
["2016-08-25","00:00:00",1,"ja","ja",null,null,1,"Berlin",null,24,{"$f":"+K12+Kürzung!F7","v":{"$error":"#REF!"}},null,0,20]
["2016-08-26","00:00:00",0.29166666666666669,"ja","ja",null,null,0.29166666666666669,"Berlin",null,0,{"$f":"+K13+Kürzung!F8","v":{"$error":"#REF!"}},null,0,20]
[{"$nulls":7},0,null,null,0,{"$f":"+K14+Kürzung!F9","v":{"$error":"#REF!"}},null,0,""]
[{"$nulls":7},0,null,null,0,{"$f":"+K15+Kürzung!F10","v":{"$error":"#REF!"}},null,0,""]
{"$rows_left_out":20}
{"sheet":"Reisekostenabrechnung - 2019","index":1,"n_rows":38,"n_cols":31,"rows_kept":38,"cut":false,"hidden":false,"merged":[[7,8,7,15],[8,8,8,9],[8,10,8,12],[9,4,9,5],[6,0,7,0],[4,4,4,14],[0,1,0,16],[35,12,35,16],[37,1,37,3],[37,4,37,6],[37,12,37,16],[35,1,35,11],[32,12,32,16],[33,5,33,6],[7,3,7,7],[28,1,28,2],[28,12,28,16],[2,1,2,3],[2,4,2,6],[2,8,2,9],[7,1,7,2],[26,1,26,3],[26,12,26,16],[2,10,2,16],[4,1,4,2]]}
[null,"Reisekostenabrechnung (Ausland) 2019"]
[]
["ACHTUNG:","für Monat",{"$nulls":6},"Name:"]
[]
[{"$f":"\"--> blaue Felder = Eingabefelder\"","v":"--> blaue Felder = Eingabefelder"},"Ich bin Arbeitnehmer?",null,null,"Ich erstelle die Abrechnung für meine Einkommensteuer/Werbekosten?"]
[]
[{"$f":"\"--> Bitte beachten Sie die\"","v":"--> Bitte beachten Sie die"}]
[null,"Reisedaten",null,"Reisezeiten",{"$nulls":4},"Übernachtung",{"$nulls":7},"Fahrtkosten"]
["Bearbeitungshinweise","Reiseziel ","Reisezweck","Reisetag","Beginn","Ende","Dauer","Verpflegungs-pauschale (VP)","Übernachtung",null,"Wurden bestimmte Mahlzeiten gestellt bzw. separat abgerechnet?",null,null,"Verpflegungspauschale abzgl. F, M, A","Nachweis (z. B. Hotelrechnung lt. Anlage)","Pauschal \n(nur ohne Nachweis)","gefahrene Strecke (gesamt)"]
[null,"Ort","Erläuterungen","Datum","Zeit",null,"Std.","EUR",null,"Hotel (Name)","Frühstück (F)","Mittagessen (M)","Abendessen (A)","EUR","EUR","EUR","km",null,"Frühstück","Mittagessen","Abendessen","Kürzung Gesamt","VMAabzgl. Kürzung","VMA","Max ","Erstattung"]
[null,"- - - - - - - - - - - ",{"$nulls":4},{"$f":"IF((ISNUMBER(D11)),(F11-E11),\"\")","v":""},{"$f":"IF((ISNUMBER(D11)),(IF(G11<TIME(8,0,0),0,IF(G11<TIME(23,59,59),VLOOKUP(B11,'VMA2016'!A:C,3,0),VLOOKUP(B11,'VMA2016'!A:B,2,0)))),0)","v":0},{"$nulls":5},{"$f":"Z11","v":0},null,{"$f":"IF(AND($D$5=\"ja\",I11=\"ja\",O11=0,$P$5=\"nein\"),VLOOKUP(B11,'VMA2016'!A:D,4,0),\"\")","v":""},null,null,{"$f":"IF(K11=\"ja\",VLOOKUP(B11,'VMA2016'!A:B,2,0)*0.2,0)","v":0},{"$f":"IF(L11=\"ja\",VLOOKUP(B11,'VMA2016'!A:B,2,0)*0.4,0)","v":0},{"$f":"IF(M11=\"ja\",VLOOKUP(B11,'VMA2016'!A:B,2,0)*0.4,0)","v":0},{"$f":"SUM(S11:U11)","v":0},{"$f":"H11-V11","v":0},{"$f":"H11","v":0},{"$f":"IF(((H11-V11)>0),(H11-V11),X11)","v":0},{"$f":"IF((W11<=0),0,Y11)","v":0},{"$f":"IF(Y11>=0,Y11,0)","v":0},{"$f":"IF(AND(S11=4.8,Z11>=0),S11,0)","v":0},{"$f":"IF(AND(T11=9.6,$Z11>=0),T11,0)","v":0},{"$f":"IF(AND(U11=9.6,$Z11>=0),U11,0)","v":0},{"$f":"SUM(AB11:AD11)","v":0}]
[null,"- - - - - - - - - - - ",{"$nulls":4},{"$f":"IF((ISNUMBER(D12)),(F12-E12),\"\")","v":""},{"$f":"IF((ISNUMBER(D12)),(IF(G12<TIME(8,0,0),0,IF(G12<TIME(23,59,59),VLOOKUP(B12,'VMA2016'!A:C,3,0),VLOOKUP(B12,'VMA2016'!A:B,2,0)))),0)","v":0},{"$nulls":5},{"$f":"Z12","v":0},null,{"$f":"IF(AND($D$5=\"ja\",I12=\"ja\",O12=0,$P$5=\"nein\"),VLOOKUP(B12,'VMA2016'!A:D,4,0),\"\")","v":""},null,null,{"$f":"IF(K12=\"ja\",VLOOKUP(B12,'VMA2016'!A:B,2,0)*0.2,0)","v":0},{"$f":"IF(L12=\"ja\",VLOOKUP(B12,'VMA2016'!A:B,2,0)*0.4,0)","v":0},{"$f":"IF(M12=\"ja\",VLOOKUP(B12,'VMA2016'!A:B,2,0)*0.4,0)","v":0},{"$f":"SUM(S12:U12)","v":0},{"$f":"H12-V12","v":0},{"$f":"H12","v":0},0,{"$f":"IF((W12<=0),0,Y12)","v":0},{"$f":"IF(Y12>=0,Y12,0)","v":0},{"$f":"IF(AND(S12=4.8,Z12>=0),S12,0)","v":0},{"$f":"IF(AND(T12=9.6,$Z12>=0),T12,0)","v":0},0]
[null,"- - - - - - - - - - - ",{"$nulls":4},{"$f":"IF((ISNUMBER(D13)),(F13-E13),\"\")","v":""},{"$f":"IF((ISNUMBER(D13)),(IF(G13<TIME(8,0,0),0,IF(G13<TIME(23,59,59),VLOOKUP(B13,'VMA2016'!A:C,3,0),VLOOKUP(B13,'VMA2016'!A:B,2,0)))),0)","v":0},{"$nulls":5},{"$f":"Z13","v":0},null,{"$f":"IF(AND($D$5=\"ja\",I13=\"ja\",O13=0,$P$5=\"nein\"),VLOOKUP(B13,'VMA2016'!A:D,4,0),\"\")","v":""},null,null,{"$f":"IF(K13=\"ja\",VLOOKUP(B13,'VMA2016'!A:B,2,0)*0.2,0)","v":0},{"$f":"IF(L13=\"ja\",VLOOKUP(B13,'VMA2016'!A:B,2,0)*0.4,0)","v":0},{"$f":"IF(M13=\"ja\",VLOOKUP(B13,'VMA2016'!A:B,2,0)*0.4,0)","v":0},{"$f":"SUM(S13:U13)","v":0},{"$f":"H13-V13","v":0},{"$f":"H13","v":0},0,0,{"$f":"IF(Y13>=0,Y13,0)","v":0},0,0,0]
[null,"- - - - - - - - - - - ",{"$nulls":4},{"$f":"IF((ISNUMBER(D14)),(F14-E14),\"\")","v":""},{"$f":"IF((ISNUMBER(D14)),(IF(G14<TIME(8,0,0),0,IF(G14<TIME(23,59,59),VLOOKUP(B14,'VMA2016'!A:C,3,0),VLOOKUP(B14,'VMA2016'!A:B,2,0)))),0)","v":0},{"$nulls":5},0,null,{"$f":"IF(AND($D$5=\"ja\",I14=\"ja\",O14=0,$P$5=\"nein\"),VLOOKUP(B14,'VMA2016'!A:D,4,0),\"\")","v":""},null,null,{"$f":"IF(K14=\"ja\",VLOOKUP(B14,'VMA2016'!A:B,2,0)*0.2,0)","v":0},{"$f":"IF(L14=\"ja\",VLOOKUP(B14,'VMA2016'!A:B,2,0)*0.4,0)","v":0},{"$f":"IF(M14=\"ja\",VLOOKUP(B14,'VMA2016'!A:B,2,0)*0.4,0)","v":0},0,0,0,0,0,0,0,0,0]
[null,"- - - - - - - - - - - ",{"$nulls":4},{"$f":"IF((ISNUMBER(D15)),(F15-E15),\"\")","v":""},{"$f":"IF((ISNUMBER(D15)),(IF(G15<TIME(8,0,0),0,IF(G15<TIME(23,59,59),VLOOKUP(B15,'VMA2016'!A:C,3,0),VLOOKUP(B15,'VMA2016'!A:B,2,0)))),0)","v":0},{"$nulls":5},0,null,{"$f":"IF(AND($D$5=\"ja\",I15=\"ja\",O15=0,$P$5=\"nein\"),VLOOKUP(B15,'VMA2016'!A:D,4,0),\"\")","v":""},null,null,{"$f":"IF(K15=\"ja\",VLOOKUP(B15,'VMA2016'!A:B,2,0)*0.2,0)","v":0},{"$f":"IF(L15=\"ja\",VLOOKUP(B15,'VMA2016'!A:B,2,0)*0.4,0)","v":0},{"$f":"IF(M15=\"ja\",VLOOKUP(B15,'VMA2016'!A:B,2,0)*0.4,0)","v":0},0,0,0,0,0,0,0,0,0]
{"$rows_left_out":24}
{"sheet":"Bearbeitungshinweise","index":2,"n_rows":38,"n_cols":31,"rows_kept":38,"cut":false,"hidden":false,"merged":[[28,12,28,16],[32,12,32,16],[35,1,35,11],[35,12,35,16],[37,1,37,3],[37,4,37,6],[37,12,37,16],[33,5,33,6],[7,1,7,2],[7,3,7,7],[7,8,7,15],[8,8,8,9],[8,10,8,12],[9,4,9,5],[26,1,26,11],[26,12,26,16],[28,1,28,2],[4,1,4,2],[4,4,4,14],[0,1,0,16],[2,1,2,3],[2,4,2,6],[2,8,2,9],[2,10,2,16]]}
[null,"Reisekostenabrechnung (Ausland) 2019"]
[]
[null,"für Monat",null,null,"Januar",null,null,null,"Name:"]
[]
[null,"Ich bin Arbeitnehmer?",null,"ja","Ich erstelle die Abrechnung für meine Einkommensteuer/Werbekosten?",{"$nulls":10},"nein"]
[]
[]
[null,"Reisedaten",null,"Reisezeiten",{"$nulls":4},"Übernachtung",{"$nulls":7},"Fahrtkosten"]
["ZURÜCK","Reiseziel ","Reisezweck","Reisetag","Beginn","Ende","Dauer","Verpflegungs-pauschale (VP)","Übernachtung",null,"Wurden bestimmte Mahlzeiten gestellt bzw. separat abgerechnet?",null,null,"Verpflegungspauschale abzgl. F, M, A","Nachweis (z. B. Hotelrechnung lt. Anlage)","Pauschal \n(nur ohne Nachweis)","gefahrene Strecke (gesamt)"]
[null,"Ort","Erläuterungen","Datum","Zeit",null,"Std.","EUR",null,"Hotel (Name)","Frühstück (F)","Mittagessen (M)","Abendessen (A)","EUR","EUR","EUR","km",null,"Frühstück","Mittagessen","Abendessen","Kürzung Gesamt","VMAabzgl. Kürzung","VMA","Max ","Erstattung"]
[null,"- - - - - - - - - - - ",{"$nulls":4},{"$f":"IF((ISNUMBER(D11)),(F11-E11),\"\")","v":""},{"$f":"IF((ISNUMBER(D11)),(IF(G11<TIME(8,0,0),0,IF(G11<TIME(23,59,59),VLOOKUP(B11,'VMA2016'!A:C,3,0),VLOOKUP(B11,'VMA2016'!A:B,2,0)))),0)","v":0},{"$nulls":5},{"$f":"Z11","v":0},null,{"$f":"IF(AND($D$5=\"ja\",I11=\"ja\",O11=0,$P$5=\"nein\"),VLOOKUP(B11,'VMA2016'!A:D,4,0),\"\")","v":""},null,null,{"$f":"IF(K11=\"ja\",[2]Kürzung!$B$30,0)","v":0},{"$f":"IF(L11=\"ja\",[2]Kürzung!$B$31,0)","v":0},{"$f":"IF(M11=\"ja\",[2]Kürzung!$B$32,0)","v":0},{"$f":"SUM(S11:U11)","v":0},{"$f":"H11-V11","v":0},{"$f":"H11","v":0},{"$f":"IF(((H11-V11)>0),(H11-V11),X11)","v":0},{"$f":"IF((W11<=0),0,Y11)","v":0},{"$f":"IF(Y11>=0,Y11,0)","v":0},{"$f":"IF(AND(S11=4.8,Z11>=0),S11,0)","v":0},{"$f":"IF(AND(T11=9.6,$Z11>=0),T11,0)","v":0},{"$f":"IF(AND(U11=9.6,$Z11>=0),U11,0)","v":0},{"$f":"SUM(AB11:AD11)","v":0}]
[null,"Äthiopien",null,"2017-10-10","08:00:00",0.91666666666666663,{"$f":"IF((ISNUMBER(D12)),(F12-E12),\"\")","v":0.58333333333333326},{"$f":"IF((ISNUMBER(D12)),(IF(G12<TIME(8,0,0),0,IF(G12<TIME(23,59,59),VLOOKUP(B12,'VMA2016'!A:C,3,0),VLOOKUP(B12,'VMA2016'!A:B,2,0)))),0)","v":18},"ja",null,"ja",null,null,{"$f":"Z12","v":13.2},null,{"$f":"IF(AND($D$5=\"ja\",I12=\"ja\",O12=0,$P$5=\"nein\"),VLOOKUP(B12,'VMA2016'!A:D,4,0),\"\")","v":86},null,null,{"$f":"IF(K12=\"ja\",[2]Kürzung!$B$30,0)","v":4.8},{"$f":"IF(L12=\"ja\",[2]Kürzung!$B$31,0)","v":0},{"$f":"IF(M12=\"ja\",[2]Kürzung!$B$32,0)","v":0},{"$f":"SUM(S12:U12)","v":4.8},{"$f":"H12-V12","v":13.2},{"$f":"H12","v":18},13.2,{"$f":"IF((W12<=0),0,Y12)","v":13.2},{"$f":"IF(Y12>=0,Y12,0)","v":13.2},{"$f":"IF(AND(S12=4.8,Z12>=0),S12,0)","v":4.8},{"$f":"IF(AND(T12=9.6,$Z12>=0),T12,0)","v":0},0]
[null,"- - - - - - - - - - - ",{"$nulls":4},{"$f":"IF((ISNUMBER(D13)),(F13-E13),\"\")","v":""},{"$f":"IF((ISNUMBER(D13)),(IF(G13<TIME(8,0,0),0,IF(G13<TIME(23,59,59),VLOOKUP(B13,'VMA2016'!A:C,3,0),VLOOKUP(B13,'VMA2016'!A:B,2,0)))),0)","v":0},{"$nulls":5},{"$f":"Z13","v":0},null,{"$f":"IF(AND($D$5=\"ja\",I13=\"ja\",O13=0,$P$5=\"nein\"),VLOOKUP(B13,'VMA2016'!A:D,4,0),\"\")","v":""},null,null,{"$f":"IF(K13=\"ja\",[2]Kürzung!$B$30,0)","v":0},{"$f":"IF(L13=\"ja\",[2]Kürzung!$B$31,0)","v":0},{"$f":"IF(M13=\"ja\",[2]Kürzung!$B$32,0)","v":0},0,{"$f":"H13-V13","v":0},{"$f":"H13","v":0},0,0,{"$f":"IF(Y13>=0,Y13,0)","v":0},0,0,0]
[null,"Andorra",null,"2017-10-14","04:00:00",0.66666666666666663,{"$f":"IF((ISNUMBER(D14)),(F14-E14),\"\")","v":0.5},{"$f":"IF((ISNUMBER(D14)),(IF(G14<TIME(8,0,0),0,IF(G14<TIME(23,59,59),VLOOKUP(B14,'VMA2016'!A:C,3,0),VLOOKUP(B14,'VMA2016'!A:B,2,0)))),0)","v":23},"ja",null,"ja","ja","nein",8.6000000000000014,120,{"$f":"IF(AND($D$5=\"ja\",I14=\"ja\",O14=0,$P$5=\"nein\"),VLOOKUP(B14,'VMA2016'!A:D,4,0),\"\")","v":""},null,null,{"$f":"IF(K14=\"ja\",[2]Kürzung!$B$30,0)","v":4.8},{"$f":"IF(L14=\"ja\",[2]Kürzung!$B$31,0)","v":9.6},{"$f":"IF(M14=\"ja\",[2]Kürzung!$B$32,0)","v":0},14.399999999999999,8.6000000000000014,23,8.6000000000000014,8.6000000000000014,8.6000000000000014,4.8,9.6,0]
[null,"- - - - - - - - - - - ",{"$nulls":4},{"$f":"IF((ISNUMBER(D15)),(F15-E15),\"\")","v":""},{"$f":"IF((ISNUMBER(D15)),(IF(G15<TIME(8,0,0),0,IF(G15<TIME(23,59,59),VLOOKUP(B15,'VMA2016'!A:C,3,0),VLOOKUP(B15,'VMA2016'!A:B,2,0)))),0)","v":0},{"$nulls":5},0,null,{"$f":"IF(AND($D$5=\"ja\",I15=\"ja\",O15=0,$P$5=\"nein\"),VLOOKUP(B15,'VMA2016'!A:D,4,0),\"\")","v":""},null,null,{"$f":"IF(K15=\"ja\",[2]Kürzung!$B$30,0)","v":0},{"$f":"IF(L15=\"ja\",[2]Kürzung!$B$31,0)","v":0},{"$f":"IF(M15=\"ja\",[2]Kürzung!$B$32,0)","v":0},0,0,0,0,0,0,0,0,0]
{"$rows_left_out":24}
{"sheet":"data_fill","index":3,"n_rows":258,"n_cols":4,"rows_kept":258,"cut":false,"hidden":true,"merged":[]}
[]
[]
["Afghanistan",null,null,"Afghanistan"]
["Ägypten",null,null,"Ägypten"]
["Äthiopien",null,null,"Äthiopien"]
["Äquatorialguinea",null,null,"Äquatorialguinea"]
["Albanien",null,null,"Albanien"]
["Algerien",null,null,"Algerien"]
["Andorra",null,null,"Andorra"]
["Angola",null,null,"Angola"]
["Antigua und Barbuda",null,null,"Antigua und Barbuda"]
["Argentinien",null,null,"Argentinien"]
["Armenien",null,null,"Armenien"]
["Aserbaidschan",null,null,"Aserbaidschan"]
["Australien",null,null,"Australien"]
{"$rows_left_out":244}
{"sheet":"VMA2016","index":4,"n_rows":241,"n_cols":8,"rows_kept":241,"cut":false,"hidden":true,"merged":[]}
[1,2,3,4,5,6,7]
["Land","volle 24 h abwesend","für An- und Abreisetag oder bei 8 h Abwesenheit","ÜN",null,null,0.2,0.4]
["- - - - - - - - - - - ",0,0,0]
["Afghanistan",30,20,95,null,null,{"$f":"B4*20/100","v":6},{"$f":"B4*40/100","v":12}]
["Ägypten",41,28,125]
["Äthiopien",27,18,86]
["Aquatorialguinea",36,24,166]
["Albanien",29,20,113,null,null,{"$f":"B8*20/100","v":5.8},{"$f":"B8*40/100","v":11.6}]
["Algerien",51,34,173,null,null,10.199999999999999,20.399999999999999]
["Andorra",34,23,45,null,null,6.8,13.6]
["Angola",77,52,265,null,null,15.4,30.8]
["Antigua und Barbuda",45,30,177,null,null,9,18]
["Argentinien",34,23,144,null,null,6.8,13.6]
["Armenien",23,16,63,null,null,4.5999999999999996,9.1999999999999993]
["Aserbaidschan",30,20,72,null,null,6,12]
{"$rows_left_out":227}
{"sheet":"VMA14","index":5,"n_rows":267,"n_cols":5,"rows_kept":267,"cut":false,"hidden":true,"merged":[]}
["Achtung: ab 2014 neues Reisekostenrecht: geänderte vereinfachte Rechtsprechung !"]
[]
["Pauschbeträge für Verpflegungsmehraufwendungen"]
["bei einer Abwesenheitsdauer je Kalendertag im Ausland (Geltungsdauer 2014)"]
["Land         mind. 24 Std.                  mind. 8 Std.       Übernachtung"]
["---------------------------------------------------------------------------------------------------------------------------------"]
[]
["Afghanistan",30,20,null,95]
["Ägypten",40,27,null,113]
["Äthiopien",30,20,null,175]
["Äquatorialguinea",50,33,null,226]
["Albanien",23,16,null,110]
["Algerien",39,26,null,190]
["Andorra",32,21,null,82]
["Angola",77,52,null,265]
{"$rows_left_out":253}
{"sheet":"VMA15","index":6,"n_rows":258,"n_cols":5,"rows_kept":258,"cut":false,"hidden":true,"merged":[]}
["Pauschbeträge für Verpflegungsmehraufwendungen"]
["bei einer Abwesenheitsdauer je Kalendertag im Ausland (Geltungsdauer 2015)"]
["Land               mind. 24 Std.            mind. 8 Std.     Übernachtung"]
["---------------------------------------------------------------------------------------------------------------------------------"]
["20% 80% 40%"]
["Afghanistan",30,20,null,95]
["Ägypten",40,27,null,113]
["Äthiopien",27,18,null,86]
["Äquatorialguinea",50,33,null,226]
["Albanien",23,16,null,110]
["Algerien",39,26,null,190]
["Andorra",32,21,null,82]
["Angola",77,52,null,265]
["Antigua und Barbuda",53,36,null,117]
["Argentinien",34,23,null,144]
{"$rows_left_out":244}
{"sheet":"Tabelle1","index":7,"n_rows":3,"n_cols":2,"rows_kept":3,"cut":false,"hidden":true,"merged":[]}
[]
[]
[null,20]

{"sheet":"Kürzung","index":8,"n_rows":48,"n_cols":6,"rows_kept":48,"cut":false,"hidden":true,"merged":[]}
[]
[]
[null,"ja"]
[null,"nein","Frühstück","Mittag ","Abendessen","SUMME"]
[null,null,{"$f":"+IF(#REF!=\"ja\",#REF!*-0.2,0)","v":{"$error":"#REF!"}},{"$f":"+IF(#REF!=\"ja\",#REF!*-0.4,0)","v":{"$error":"#REF!"}},{"$f":"+IF(#REF!=\"ja\",#REF!*-0.4,0)","v":{"$error":"#REF!"}},{"$f":"SUM(C5:E5)","v":{"$error":"#REF!"}}]
[null,null,{"$f":"+IF(#REF!=\"ja\",#REF!*-0.2,0)","v":{"$error":"#REF!"}},{"$f":"+IF(#REF!=\"ja\",#REF!*-0.4,0)","v":{"$error":"#REF!"}},{"$f":"+IF(#REF!=\"ja\",#REF!*-0.4,0)","v":{"$error":"#REF!"}},{"$f":"SUM(C6:E6)","v":{"$error":"#REF!"}}]
[null,null,{"$f":"+IF(#REF!=\"ja\",#REF!*-0.2,0)","v":{"$error":"#REF!"}},{"$f":"+IF(#REF!=\"ja\",#REF!*-0.4,0)","v":{"$error":"#REF!"}},{"$f":"+IF(#REF!=\"ja\",#REF!*-0.4,0)","v":{"$error":"#REF!"}},{"$error":"#REF!"}]
[null,null,{"$f":"+IF(#REF!=\"ja\",#REF!*-0.2,0)","v":{"$error":"#REF!"}},{"$f":"+IF(#REF!=\"ja\",#REF!*-0.4,0)","v":{"$error":"#REF!"}},{"$f":"+IF(#REF!=\"ja\",#REF!*-0.4,0)","v":{"$error":"#REF!"}},{"$error":"#REF!"}]
[null,null,{"$f":"+IF(#REF!=\"ja\",#REF!*-0.2,0)","v":{"$error":"#REF!"}},{"$f":"+IF(#REF!=\"ja\",#REF!*-0.4,0)","v":{"$error":"#REF!"}},{"$f":"+IF(#REF!=\"ja\",#REF!*-0.4,0)","v":{"$error":"#REF!"}},{"$error":"#REF!"}]
[null,null,{"$f":"+IF(#REF!=\"ja\",#REF!*-0.2,0)","v":{"$error":"#REF!"}},{"$f":"+IF(#REF!=\"ja\",#REF!*-0.4,0)","v":{"$error":"#REF!"}},{"$f":"+IF(#REF!=\"ja\",#REF!*-0.4,0)","v":{"$error":"#REF!"}},{"$error":"#REF!"}]
[null,null,{"$f":"+IF(#REF!=\"ja\",#REF!*-0.2,0)","v":{"$error":"#REF!"}},{"$f":"+IF(#REF!=\"ja\",#REF!*-0.4,0)","v":{"$error":"#REF!"}},{"$f":"+IF(#REF!=\"ja\",#REF!*-0.4,0)","v":{"$error":"#REF!"}},{"$error":"#REF!"}]
[null,null,{"$f":"+IF(#REF!=\"ja\",#REF!*-0.2,0)","v":{"$error":"#REF!"}},{"$f":"+IF(#REF!=\"ja\",#REF!*-0.4,0)","v":{"$error":"#REF!"}},{"$f":"+IF(#REF!=\"ja\",#REF!*-0.4,0)","v":{"$error":"#REF!"}},{"$error":"#REF!"}]
[null,null,{"$f":"+IF(#REF!=\"ja\",#REF!*-0.2,0)","v":{"$error":"#REF!"}},{"$f":"+IF(#REF!=\"ja\",#REF!*-0.4,0)","v":{"$error":"#REF!"}},{"$f":"+IF(#REF!=\"ja\",#REF!*-0.4,0)","v":{"$error":"#REF!"}},{"$error":"#REF!"}]
[null,null,{"$f":"+IF(#REF!=\"ja\",#REF!*-0.2,0)","v":{"$error":"#REF!"}},{"$f":"+IF(#REF!=\"ja\",#REF!*-0.4,0)","v":{"$error":"#REF!"}},{"$f":"+IF(#REF!=\"ja\",#REF!*-0.4,0)","v":{"$error":"#REF!"}},{"$error":"#REF!"}]
[null,null,{"$f":"+IF(#REF!=\"ja\",#REF!*-0.2,0)","v":{"$error":"#REF!"}},{"$f":"+IF(#REF!=\"ja\",#REF!*-0.4,0)","v":{"$error":"#REF!"}},{"$f":"+IF(#REF!=\"ja\",#REF!*-0.4,0)","v":{"$error":"#REF!"}},{"$error":"#REF!"}]
{"$rows_left_out":33}